{"text_format":"1","workbook":"xlsx","n_sheets":20,"sheets":["入力","物1","工1","1別1","工1別2","工1別3","2","3","3別","4","5","6","7","7別","8","封筒例","予定価格封筒","スケジュール","祝祭日","入力補助"],"not_rendered":{"charts":0,"images":1,"macros":1,"external_links":0,"defined_names":13,"comments":2,"pivot_tables":0},"unopened":[],"bounds":{"document_bytes":16777216,"sheet_cells":100000,"rows_first":2000,"rows_last":500,"rows_between":2000,"halvings":0,"cell_chars":16384,"cell_head_chars":4096},"cells_cut":0,"cells_raw":0,"read":"whole","date_system":"1900"}

{"sheet":"入力","index":0,"n_rows":28,"n_cols":21,"rows_kept":28,"cut":false,"hidden":false,"merged":[[6,1,6,2],[7,1,7,2],[8,1,8,2],[9,1,9,2],[10,1,16,1],[3,3,3,5],[5,3,5,6],[2,1,2,2],[3,1,3,2],[4,1,4,2],[5,1,5,2]]}
[]
[]
[1,"局名",null,"秋田",null,null,null,null,null,null,null,{"$f":"$D$3&\"労働局\"&VLOOKUP(D3,局名データ,2,0)","v":"秋田労働局総務部長"},{"$f":"VLOOKUP(D4,入札参加資格データ,3,0)","v":3}]
[2,"入札参加資格",null,"物品製造等",null,null,null,null,null,null,null,{"$f":"IF(M3=2,TEXT(M4,\"ggg\")&TEXT(M4,\"e\")&\"・\"&TEXT(N4,\"e\")&\"年度\",IF(M3=3,TEXT(M4,\"ggg\")&TEXT(M4,\"e\")&\"・\"&TEXT(N4,\"e\")&\"・\"&TEXT(O4,\"e\")&\"年度\",\"?\"))","v":"平成31・2・3年度"},{"$f":"VLOOKUP(D4,入札参加資格データ,4,0)","v":43556},{"$f":"EDATE(M4,12)","v":43922},{"$f":"EDATE(M4,24)","v":44287}]
[3,"資格有効年度",null,{"$f":"EDATE(D11,SUM(-36,M5))","v":46491},null,null,null,null,null,null,null,{"$f":"TEXT(N5,\"ggg\")&TEXT(N5,\"e\")&\"・\"&TEXT(N5,\"e\")+1&\"・\"&TEXT(N5,\"e\")+2&\"年度\"","v":"令和7・8・9年度"},48,{"$f":"IF(D4=入力補助!E2,VLOOKUP(D5,資格有効年度データ,1,TRUE),IF(D4=入力補助!E3,VLOOKUP(D5,資格有効年度データ,2,TRUE),IF(D4=入力補助!E4,VLOOKUP(D5,資格有効年度データ,3,TRUE),\"?\")))","v":45748}]
[4,"調達件名",null,"湯沢公共職業安定所空調機器等保守点検業務委託契約",null,null,null,null,null,null,null,null,1]
[5,"担当部署",null,"会計第一係"]
[6,"FAX番号",null,null,null,null,null,null,null,null,null,{"$f":"DBCS(D8)","v":""}]
[7,"担当者",null,"熊谷　光平",null,null,null,null,null,null,null,{"$f":"IFERROR(LEFT(D9,FIND(\" \",D9,1)-1),LEFT(D9,FIND(\"　\",D9,1)-1))","v":"熊谷"}]
[null,"消費税",null,10,null,null,null,null,null,null,null,{"$f":"IF((D10-INT(D10))*100=0,TEXT(D10,\"[DBNum3]0\"),TEXT(D10,\"[DBNum3]0.00\"))","v":"１０"},{"$f":"IF((D10-INT(D10))*100=0,TEXT(SUM(D10,100),\"[DBNum3]0\"),TEXT(SUM(D10,100),\"[DBNum3]0.00\"))","v":"１１０"}]
[8,"スケジュール","入札公告","2026-04-14",null,null,null,null,null,null,null,null,{"$f":"IF(MONTH(D11)>=4,DATE(YEAR(D11),MONTH(D11),1),DATE(YEAR(D11),MONTH(D11),1))","v":"2026-04-01"},null,null,null,null,{"$f":"C11","v":"入札公告"}]
[null,null,"質問締切","2026-04-20","15:00:00",null,null,null,null,null,null,{"$f":"IF(AND($D$12>=43586,$D$12<=43830),TEXT($D12,\"[DBNum3]令和元年m月d日（aaa）\"),TEXT($D12,\"[DBNum3]ggge年m月d日（aaa）\"))","v":"令和８年４月２０日(月)"},{"$f":"IF(MINUTE(E12)=0,TEXT($E12,\"[DBNum3]h時\"),TEXT($E12,\"[DBNum3]h時mm分\"))","v":"１５時"},null,null,null,null,"質問締切",{"$f":"TEXT(E12,\"hh:mm\")","v":"15:00"}]
[null,null,"質問回答","2026-04-23","15:00:00",null,null,null,null,null,null,null,null,null,null,null,null,"質問回答","15:00"]
[null,null,"参加申込締切","2026-04-30","12:00:00",null,null,null,null,null,null,{"$f":"IF(AND($D$14>=43586,$D$14<=43830),\"令和　　年　　月　　日\",TEXT($D14,\"ggg\")&\"　　年　　月　　日\")","v":"令和　　年　　月　　日"},{"$f":"IF(AND($D$14>=43586,$D$14<=43830),\"令和○○年○○月○○日\",TEXT($D14,\"ggg\")&\"○○年○○月○○日\")","v":"令和○○年○○月○○日"},null,null,{"$f":"IF(MONTH(D14)>=4,DATE(YEAR(D14)-2,4,1),DATE(YEAR(D14)-3,4,1))","v":"2024-04-01"},{"$f":"TEXT(P14,\"ggg\")&TEXT(P14,\"[DBNum3]e\")","v":"令和６"},"参加申込締切","12:00"]
[null,null,"入札締切","2026-05-01","10:00:00",null,null,null,null,null,null,null,null,null,null,{"$f":"IF(MONTH(D14)>=4,DATE(YEAR(D14)-1,4,1),DATE(YEAR(D14)-2,4,1))","v":"2025-04-01"},{"$f":"TEXT(P15,\"ggg\")&TEXT(P15,\"[DBNum3]e\")","v":"令和７"},"入札締切","10:00",{"$f":"C16","v":"開札"},{"$f":"TEXT(E16,\"hh:mm\")","v":"11:00"}]
[null,null,"開札","2026-05-01","11:00:00",null,null,null,null,null,null,{"$f":"IF(AND($D$16>=43586,$D$16<=43830),\"令和\",TEXT($D16,\"ggg\"))","v":"令和"},{"$f":"TEXT($D16,\"e\")","v":"8"},{"$f":"TEXT($D16,\"m\")","v":"5"},{"$f":"TEXT($D16,\"d\")","v":"1"},{"$f":"IF(MONTH(D14)>=4,DATE(YEAR(D14),4,1),DATE(YEAR(D14)-1,4,1))","v":"2026-04-01"},{"$f":"TEXT(P16,\"ggg\")&TEXT(P16,\"[DBNum3]e\")","v":"令和８"}]
[null,null,{"$f":"IF(D4=入力補助!E2,\"納期\",IF(D4=入力補助!E3,\"工期\",IF(D4=入力補助!E4,\"納期\",\"参加資格を入力\")))","v":"納期"},null,null,null,null,null,null,null,null,{"$f":"IF(AND($D$17>=43586,$D$17<=43830),TEXT(C17,\"@\")&\"：\"&TEXT(D17,\"[DBNum3]令和元年m月d日\"),TEXT(C17,\"@\")&\"：\"&TEXT(D17,\"[DBNum3]ggge年m月d日\"))","v":"納期：明治３３年１月０日"},{"$f":"EDATE(M11,3)-1","v":"2026-06-30"},null,null,null,null,"納期"]
[]
[]
[]
{"$rows_left_out":9}
{"sheet":"物1","index":1,"n_rows":63,"n_cols":9,"rows_kept":63,"cut":false,"hidden":false,"merged":[[47,3,47,8],[59,6,59,7],[60,6,60,7],[51,0,51,4],[53,2,53,4],[54,3,54,4],[55,6,55,7],[56,6,56,7],[57,6,57,7],[58,6,58,7],[49,4,49,8],[8,0,8,8],[4,0,6,8],[2,0,2,8],[44,4,44,8],[10,2,10,3],[10,4,11,8],[37,3,38,8],[42,3,42,8],[28,3,31,8],[20,3,20,8],[14,3,14,8],[34,4,34,8],[26,4,26,8],[17,3,17,8],[23,3,24,8]]}
[null,null,null,null,null,null,null,null,"様式１"]
[]
["一般競争入札参加申込書"]
[]
[{"$f":"\"　「\"&入力!$D$6&\"」の件について、一般競争入札実施に関する公告を拝見し、一般競争入札に参加いたしたく下記により申込いたします。\"","v":"　「湯沢公共職業安定所空調機器等保守点検業務委託契約」の件について、一般競争入札実施に関する公告を拝見し、一般競争入札に参加いたしたく下記により申込いたします。"}]
[]
[]
[]
["記"]
[]
[1,null,"件名",null,{"$f":"\"　\"&入力!$D$6","v":"　湯沢公共職業安定所空調機器等保守点検業務委託契約"}]
[]
[]
[2,null,"競争に参加する者に必要な資格に関する事項等について"]
[null,null,"○","予算決算及び会計令第７０条及び第７１条の規定に該当しない。"]
[null,null,null,null,null,null,"はい　・　いいえ"]
[]
[null,null,"○","契約後、適正な契約の履行が可能である。"]
[null,null,null,null,null,null,"はい　・　いいえ"]
[]
{"$rows_left_out":44}
{"sheet":"工1","index":2,"n_rows":35,"n_cols":7,"rows_kept":35,"cut":false,"hidden":true,"merged":[[33,1,33,4],[34,1,34,4],[2,0,2,6],[21,0,21,6],[22,0,22,6],[6,3,6,6],[28,1,28,4],[29,1,29,4],[30,1,30,4],[31,1,31,4],[32,1,32,4]]}
[null,null,null,null,null,null,"様式１"]
[]
["競争入札参加資格確認申請書"]
[]
[]
[]
[null,null,null,{"$f":"入力!$L$14","v":"令和　　年　　月　　日"}]
[]
[null,"支出負担行為担当官"]
[null,null,{"$f":"入力!$L$3&\"　殿\"","v":"秋田労働局総務部長　殿"}]
[]
[]
[]
[null,null,"［申請者］"]
[null,null,null,"住所又は所在地"]
[null,null,null,"商号又は名称"]
[null,null,null,"代表者氏名",null,null,"㊞"]
[null,null,null,"電話番号"]
[null,null,null,"F A X番号"]
[]
{"$rows_left_out":16}
{"sheet":"1別1","index":3,"n_rows":34,"n_cols":9,"rows_kept":34,"cut":false,"hidden":false,"merged":[[33,3,33,5],[14,0,15,8],[7,0,10,8],[11,0,13,8],[4,0,4,8],[32,2,32,4]]}
[]
[]
[null,null,null,null,null,null,null,null,"様式１別紙１"]
[]
["保険料納付に係る申立書"]
[]
[]
["　当社は、直近２年間に支払うべき社会保険料（厚生年金保険、健康保険、（全国健康保険協会管掌のもの）、船員保険及び国民年金の保険料をいう。）及び直近２保険年度に支払うべき労働保険料（労働者災害補償保険及び雇用保険の保険料をいう。）について、一切滞納がないことを申し立てます。\n　なお、この申立書に虚偽内容が認められたときは、履行途中にあるか否かを問わず当社に対する一切の契約が解除され、損害賠償金を請求され、併せて競争参加資格の停止処分を受けることに意義はありません。\n　また、当該保険料の納付事実を確認するために関係書類の提示・提出を求められたときは、速やかに対応することを確約いたします。"]
[]
[]
[]
["　なお、この申立書に虚偽内容が認められたときは、履行途中にあるか否かを問わず当社に対する一切の契約が解除され、損害賠償金を請求され、併せて競争参加資格の停止処分を受けることに意義はありません。\n　また、当該保険料の納付事実を確認するために関係書類の提示・提出を求められたときは、速やかに対応することを確約いたします。"]
[]
[]
["　また、当該保険料の納付事実を確認するために関係書類の提示・提出を求められたときは、速やかに対応することを確約いたします。"]
[]
[]
[]
[]
[]
{"$rows_left_out":15}
{"sheet":"工1別2","index":4,"n_rows":35,"n_cols":7,"rows_kept":35,"cut":false,"hidden":true,"merged":[[2,0,2,6],[7,0,8,0],[7,1,8,1],[7,5,8,6]]}
[null,null,null,null,null,null,"様式１別紙２"]
[]
["同　種　業　務　の　実　績"]
[]
[]
[null,null,null,null,null,"商号又は名称"]
[]
["業務名","発注者名","業務場所","契約金額","業務年度及び期間","業務の概要"]
[null,null,"（都道府県）","（百万円）","（月数）"]
[]
[]
[]
[]
[]
[]
[]
[]
[]
[]
[]
{"$rows_left_out":16}
{"sheet":"工1別3","index":5,"n_rows":36,"n_cols":10,"rows_kept":36,"cut":false,"hidden":true,"merged":[[2,0,2,9],[7,0,9,0],[7,1,9,1],[7,2,9,2],[7,3,7,9],[8,3,9,3],[8,4,9,4],[8,8,9,8],[8,9,9,9]]}
[null,null,null,null,null,null,null,null,null,"様式１別紙３"]
[]
["配置予定技術者の資格・業務経歴"]
[]
[]
[null,null,null,null,null,null,null,"商号又は名称"]
[]
["氏名","区分","所持している資格取得年・登録番号等","従事した業務の内容等"]
[null,null,null,"業務名","発注者名","実施場所","契約金額","実施年度及び期間","従事役職","業務概要"]
[null,null,null,null,null,"（都道府県）","（百万円）","（月数）"]
[]
[]
[]
[]
[]
[]
[]
[]
[]
[]
{"$rows_left_out":17}
{"sheet":"2","index":6,"n_rows":32,"n_cols":6,"rows_kept":32,"cut":false,"hidden":false,"merged":[[29,2,29,5],[3,4,3,5],[18,0,18,5],[20,0,21,5],[23,0,23,5],[25,2,25,5],[26,2,27,5]]}
[null,null,null,null,null,"様式２"]
[]
[]
[null,null,null,null,{"$f":"入力!$L$14","v":"令和　　年　　月　　日"}]
[]
[]
[]
["支出負担行為担当官"]
[null,{"$f":"入力!$L$3&\"　殿\"","v":"秋田労働局総務部長　殿"}]
[]
[]
[]
[null,null,null,"住所又は所在地　"]
[null,null,null,"商号又は名称"]
[null,null,null,"代表者氏名"]
[]
[]
[]
["電子入札案件の紙入札方式での参加について"]
[]
{"$rows_left_out":13}
{"sheet":"3","index":7,"n_rows":52,"n_cols":7,"rows_kept":52,"cut":false,"hidden":false,"merged":[[9,0,9,6],[7,0,8,6],[11,0,11,6],[13,2,13,6],[2,0,2,6],[4,3,5,6],[4,1,4,2],[5,1,5,2],[6,0,6,6],[50,0,50,6],[51,0,51,6],[40,1,40,3],[14,2,20,6],[21,2,22,6],[23,2,25,6],[26,2,27,6],[28,2,29,6],[49,0,49,6],[31,2,31,6],[32,2,32,6],[33,2,33,6],[34,2,34,6],[35,2,35,6],[36,2,36,6]]}
[null,null,null,null,null,null,"様式３"]
[]
["誓　　約　　書"]
[]
["□"," 私",null,"は、下記１及び２のいずれにも該当しません。"]
["□"," 当社"]
["　また、将来においても該当することはありません。"]
["　この制約が虚偽であり、又はこの誓約に反したことにより、当方が不利益を被ることとなっても、異議は一切申し立てません。"]
[]
["　また、当方の個人情報を警察に提供することについて同意します。"]
[]
["記"]
[]
[1,null,"契約の相手方として不適当な者"]
[null,1,"　法人等（個人、法人又は団体をいう。）の役員等（個人である場合はその者、法人である場合は役員又は支店若しくは営業所（常時契約を締結する事務所をいう。）の代表者、団体である場合は代表者、理事等、その他経営に実質的に関与している者をいう。）が、暴力団（暴力団員による不当な行為の防止等に関する法律（平成３年法律第77号）第２条第２号に規定する暴力団をいう。以下同じ）又は暴力団員（同法第２条第６号に規定する暴力団員をいう。以下同じ。）であるとき"]
[]
[]
[]
[]
[]
{"$rows_left_out":33}
{"sheet":"3別","index":8,"n_rows":30,"n_cols":4,"rows_kept":30,"cut":false,"hidden":false,"merged":[[11,0,12,0],[13,0,14,0],[7,0,8,0],[9,0,10,0],[15,0,16,0],[17,0,18,0],[15,1,15,2],[16,1,16,2],[17,1,17,2],[18,1,18,2],[23,0,24,0],[19,0,20,0],[21,0,22,0],[19,1,19,2],[20,1,20,2],[21,1,21,2],[22,1,22,2],[23,1,23,2],[24,1,24,2],[23,3,24,3],[21,3,22,3],[19,3,20,3],[17,3,18,3],[15,3,16,3],[13,3,14,3],[11,3,12,3],[9,3,10,3],[7,3,8,3],[6,1,6,2],[7,1,7,2],[8,1,8,2],[9,1,9,2],[10,1,10,2],[11,1,11,2],[12,1,12,2],[13,1,13,2],[14,1,14,2]]}
[null,null,null,"様式３別紙"]
[]
[]
[]
[null,null,"事業所名"]
["【役員等】"]
["役職名","氏名",null,"生年月日"]
[null,"(ﾌﾘｶﾞﾅ)"]
[]
[null,"(ﾌﾘｶﾞﾅ)"]
[]
[null,"(ﾌﾘｶﾞﾅ)"]
[]
[null,"(ﾌﾘｶﾞﾅ)"]
[]
[null,"(ﾌﾘｶﾞﾅ)"]
[]
[null,"(ﾌﾘｶﾞﾅ)"]
[]
[null,"(ﾌﾘｶﾞﾅ)"]
{"$rows_left_out":11}
{"sheet":"4","index":9,"n_rows":39,"n_cols":5,"rows_kept":39,"cut":false,"hidden":false,"merged":[[6,0,6,4],[7,0,9,4],[3,0,3,4],[22,1,23,4],[20,1,21,4],[17,1,18,4],[15,1,16,4],[12,0,12,4],[19,1,19,4]]}
[null,null,null,null,"様式４"]
[]
[]
["自己申告書"]
[]
[]
["　下記の内容について誓約いたします。"]
["　なお、この誓約書に虚偽があったことが判明した場合、又は報告すべき事項を報告しなかったことが判明した場合には、本契約を解除されるなど当方が不利益を被ることとなっても、異議は一切申し立てません。"]
[]
[]
[]
[]
["記"]
[]
[]
[1,"　厚生労働省から指名停止の措置を受けている期間中でないこと。【建設工事の場合は国・県・市町村とする】"]
[]
[2,"　過去１年以内に、当社又はその役員若しくは使用人が、厚生労働省所管法令の違反により行政処分を受け又は送検されていないこと。"]
[]
[3,"　事業の実施に当たっては、各種法令を遵守すること。"]
{"$rows_left_out":20}
{"sheet":"5","index":10,"n_rows":20,"n_cols":5,"rows_kept":20,"cut":false,"hidden":false,"merged":[[5,0,5,2],[4,0,4,2],[31,0,31,4],[32,0,32,4],[33,0,33,4],[8,0,8,4],[17,1,17,2],[18,3,18,4],[34,0,34,4],[35,0,35,4],[50,0,50,4],[51,0,51,4],[12,0,12,4],[14,1,15,4],[41,0,41,4],[42,0,42,4],[22,0,22,4],[23,0,23,4],[24,0,24,4],[25,0,25,4],[45,0,45,4],[46,0,46,4],[47,0,47,4],[48,0,48,4],[49,0,49,4],[19,1,19,4],[20,0,20,4],[21,0,21,4],[43,0,43,4],[44,0,44,4],[26,0,26,4],[27,0,27,4],[28,0,28,4],[36,0,36,4],[37,0,37,4],[38,0,38,4],[39,0,39,4],[40,0,40,4],[29,0,29,4],[30,0,30,4]]}
[null,null,null,null,"様式５"]
[]
[]
["宛先"]
[{"$f":"入力!$D$3&\"労働局総務部総務課\"&入力!$D$7&\"　\"&入力!$L$9&\"　あて\"","v":"秋田労働局総務部総務課会計第一係　熊谷　あて"}]
["メールアドレス：akitakaikei１@mhlw.go.jp"]
[]
[]
[{"$f":"\"※ 受付締切（厳守）　\"&入力!$L$12&入力!$M$12&\"まで\"","v":"※ 受付締切（厳守）　令和８年４月２０日(月)１５時まで"}]
[]
[]
[]
["質　問　書"]
[]
["件名",{"$f":"入力!$D$6","v":"湯沢公共職業安定所空調機器等保守点検業務委託契約"}]
[]
[]
["商号又は名称",null,null,"担当者名"]
["電話番号",null,"メール\nアドレス"]
["質問事項"]
{"$rows_left_out":1}
{"sheet":"6","index":11,"n_rows":46,"n_cols":6,"rows_kept":46,"cut":false,"hidden":false,"merged":[[4,0,4,5],[24,2,25,5],[44,0,44,2],[45,0,45,2],[15,0,15,5],[12,1,13,1],[12,4,13,4],[38,4,38,5],[32,4,32,5],[9,2,9,4],[12,2,13,3],[36,4,36,5],[37,4,37,5],[21,0,21,5]]}
[null,null,null,null,null,"様式６"]
[]
[]
[]
["委　任　状"]
[]
[]
[]
[null,"（商号）"]
["　私は、","又は"]
[null,"（名称）"]
[]
[null,"（氏名）"]
[null,null,null,null,null,"　を代理人と定め"]
[]
["下記事項の入札及び見積りに関する一切の権限を委任します。"]
[]
[null,"□　入札及び見積について"]
[null,"□　契約締結について"]
[null,"※該当する項目にチェック入れること。"]
{"$rows_left_out":27}
{"sheet":"7","index":12,"n_rows":42,"n_cols":7,"rows_kept":42,"cut":false,"hidden":false,"merged":[[4,0,4,6],[36,2,36,5],[8,5,8,6],[30,1,31,6],[12,0,12,1],[13,0,13,2],[34,2,35,5],[16,5,16,6],[17,5,17,6],[18,5,18,6],[21,5,21,6]]}
[null,null,null,null,null,null,"様式７"]
[]
[]
[]
["入　札　書"]
[]
[]
[]
[null,null,null,null,null,{"$f":"入力!$L$14","v":"令和　　年　　月　　日"}]
[]
[]
[]
["支出負担行為担当官"]
[{"$f":"\"　\"&入力!$L$3&\"　殿\"","v":"　秋田労働局総務部長　殿"}]
[]
[]
[null,null,null,null,"住所又は所在地"]
[null,null,"入札者",null,"商号又は名称"]
[null,null,null,null,"代表者氏名"]
[]
{"$rows_left_out":23}
{"sheet":"7別","index":13,"n_rows":35,"n_cols":8,"rows_kept":35,"cut":false,"hidden":false,"merged":[[25,6,25,7],[24,6,24,7],[27,1,30,7],[25,0,25,1],[24,0,24,1],[21,0,21,1],[21,6,21,7],[20,0,20,1],[20,6,20,7],[23,0,23,1],[23,6,23,7],[17,0,17,1],[17,6,17,7],[16,0,16,1],[16,6,16,7],[19,0,19,1],[19,6,19,7],[18,0,18,1],[18,6,18,7],[13,0,13,1],[13,6,13,7],[12,0,12,1],[12,6,12,7],[15,0,15,1],[15,6,15,7],[14,0,14,1],[14,6,14,7],[1,0,1,7],[22,6,22,7],[22,0,22,1],[7,0,7,1],[7,6,7,7],[4,0,4,3],[6,0,6,1],[6,6,6,7],[9,0,9,1],[9,6,9,7],[8,0,8,1],[8,6,8,7],[11,0,11,1],[11,6,11,7],[10,0,10,1],[10,6,10,7]]}
[null,null,null,null,null,null,null,"様式７別紙"]
["見積内訳書"]
[]
["業務名"]
[{"$f":"入力!$D$6","v":"湯沢公共職業安定所空調機器等保守点検業務委託契約"},null,null,null,null,"見積金額",null,".―"]
[]
["名称",null,"摘要","数量","単位","単価（円）","金額（円）"]
[null,null,null,null,null,null,{"$f":"IF(OR(ISBLANK(D8),ISBLANK(F8)),\"\",D8*F8)","v":""}]
[null,null,null,null,null,null,{"$f":"IF(OR(ISBLANK(D9),ISBLANK(F9)),\"\",D9*F9)","v":""}]
[null,null,null,null,null,null,""]
[null,null,null,null,null,null,""]
[null,null,null,null,null,null,""]
[null,null,null,null,null,null,""]
[null,null,null,null,null,null,""]
[null,null,null,null,null,null,""]
[null,null,null,null,null,null,""]
[null,null,null,null,null,null,""]
[null,null,null,null,null,null,""]
[null,null,null,null,null,null,""]
[null,null,null,null,null,null,""]
{"$rows_left_out":16}
{"sheet":"8","index":14,"n_rows":54,"n_cols":8,"rows_kept":54,"cut":false,"hidden":false,"merged":[[28,1,29,8]]}
[null,null,null,null,null,null,null,"別紙８"]
[]
[]
[]
[]
["電子契約によらない紙方式による契約を締結することについて"]
[]
[]
[null,null,null,null,null,null,"令和　   年 　  月 　  日"]
[]
["支出負担行為担当官"]
["   秋田労働局総務部長 殿"]
[]
[null,null,null,null,"住 　　　所"]
[null,null,null,null,"商号又は名称"]
[null,null,null,null,"代表者職氏名"]
[]
[]
[]
["       貴局発注の下記入札案件について、政府電子調達システム(GEPS)を利用した電子"]
{"$rows_left_out":35}
{"sheet":"封筒例","index":15,"n_rows":17,"n_cols":14,"rows_kept":17,"cut":false,"hidden":false,"merged":[[0,0,0,14],[12,4,18,4],[2,0,2,5],[2,7,2,14],[5,13,18,13],[5,12,18,12],[7,9,17,9],[16,8,19,8],[11,1,13,1],[11,2,13,2]]}
["封筒記載例"]
[]
["裏　面",null,null,null,null,null,null,"表　面"]
[]
[]
[null,null,null,null,null,null,null,null,null,null,null,null,{"$f":"\"　\"&入力!$L$3&\"　殿\"","v":"　秋田労働局総務部長　殿"},"支出負担行為担当官"]
[null,null,null,null,null,null,null,null,null,null,{"$f":"\"「\"&入力!$L$16","v":"「令和"}]
[null,null,null,null,null,null,null,null,null,{"$f":"\"［\"&入力!$D$6&\"］\"","v":"［湯沢公共職業安定所空調機器等保守点検業務委託契約］"},{"$f":"入力!$M$16","v":"8"}]
[null,null,null,null,null,null,null,null,null,null,"年"]
[null,null,null,null,null,null,null,null,null,null,{"$f":"入力!$N$16","v":"5"}]
[null,null,null,null,null,null,null,null,null,null,"月"]
[null,"商号又は名称","住所又は所在地",null,null,null,null,null,null,null,{"$f":"入力!$O$16","v":"1"}]
[null,null,null,null,{"$f":"入力!$L$14","v":"令和　　年　　月　　日"},null,null,null,null,null,"日開札"]
[]
[]
[]
[null,null,null,null,null,null,null,null,"の入札書在中」"]

{"sheet":"予定価格封筒","index":16,"n_rows":12,"n_cols":8,"rows_kept":12,"cut":false,"hidden":false,"merged":[[2,3,11,4],[2,7,11,9]]}
[]
[]
[null,null,null,"予定価格調書 在中",null,null,null,{"$f":"入力!$D$6","v":"湯沢公共職業安定所空調機器等保守点検業務委託契約"}]
[]
[null,{"$f":"入力!$L$16","v":"令和"}]
[null,{"$f":"入力!$M$16","v":"8"}]
[null,"年"]
[null,{"$f":"入力!$N$16","v":"5"}]
[null,"月"]
[null,{"$f":"入力!$O$16","v":"1"}]
[null,"日"]
[null,"開札"]

{"sheet":"スケジュール","index":17,"n_rows":17,"n_cols":31,"rows_kept":17,"cut":false,"hidden":false,"merged":[[16,23,16,30],[1,0,1,1],[6,0,6,1],[11,0,11,1],[0,0,0,30]]}
[{"$f":"入力!$D$6","v":"湯沢公共職業安定所空調機器等保守点検業務委託契約"}]
[{"$f":"入力!$M$11","v":"2026-04-01"}]
[{"$f":"A2","v":"2026-04-01"},{"$f":"A3+1","v":"2026-04-02"},{"$f":"B3+1","v":"2026-04-03"},{"$f":"C3+1","v":"2026-04-04"},{"$f":"D3+1","v":"2026-04-05"},{"$f":"E3+1","v":"2026-04-06"},{"$f":"F3+1","v":"2026-04-07"},{"$f":"G3+1","v":"2026-04-08"},{"$f":"H3+1","v":"2026-04-09"},{"$f":"I3+1","v":"2026-04-10"},{"$f":"J3+1","v":"2026-04-11"},{"$f":"K3+1","v":"2026-04-12"},{"$f":"L3+1","v":"2026-04-13"},{"$f":"M3+1","v":"2026-04-14"},{"$f":"N3+1","v":"2026-04-15"},{"$f":"O3+1","v":"2026-04-16"},{"$f":"P3+1","v":"2026-04-17"},{"$f":"Q3+1","v":"2026-04-18"},{"$f":"R3+1","v":"2026-04-19"},{"$f":"S3+1","v":"2026-04-20"},{"$f":"T3+1","v":"2026-04-21"},{"$f":"U3+1","v":"2026-04-22"},{"$f":"V3+1","v":"2026-04-23"},{"$f":"W3+1","v":"2026-04-24"},{"$f":"X3+1","v":"2026-04-25"},{"$f":"Y3+1","v":"2026-04-26"},{"$f":"Z3+1","v":"2026-04-27"},{"$f":"AA3+1","v":"2026-04-28"},{"$f":"AB3+1","v":"2026-04-29"},{"$f":"AC3+1","v":"2026-04-30"},{"$f":"AD3+1","v":"2026-05-01"}]
[{"$f":"A3","v":46113},{"$f":"B3","v":46114},46115,46116,46117,46118,46119,46120,46121,{"$f":"J3","v":46122},46123,46124,46125,46126,46127,46128,{"$f":"Q3","v":46129},46130,46131,46132,46133,46134,46135,46136,{"$f":"Y3","v":46137},46138,46139,46140,46141,{"$f":"AD3","v":46142},46143]
[{"$f":"IFERROR(VLOOKUP(A3,祝祭日,6,0),IFERROR(VLOOKUP(A3,振替日,4,0)&\"の振替\",IFERROR(VLOOKUP(A3,入札スケジュール,15,0)&VLOOKUP(A3,入札スケジュール,16,0)&CHAR(10)&CHAR(10)&VLOOKUP(A3,入札スケジュール,17,0)&VLOOKUP(A3,入札スケジュール,18,0),\"\")))","v":""},"","","","","","","","","","","","","入札公告\n\n","","","","","","質問締切15:00\n\n","","","質問回答15:00\n\n","","","","","","昭和の日","国民の休日","天皇即位の日"]
[]
[{"$f":"EDATE(A2,1)","v":"2026-05-01"}]
[{"$f":"A7","v":"2026-05-01"},{"$f":"A8+1","v":"2026-05-02"},{"$f":"B8+1","v":"2026-05-03"},"2026-05-04","2026-05-05","2026-05-06","2026-05-07","2026-05-08","2026-05-09","2026-05-10","2026-05-11","2026-05-12","2026-05-13","2026-05-14","2026-05-15","2026-05-16","2026-05-17","2026-05-18","2026-05-19","2026-05-20","2026-05-21","2026-05-22","2026-05-23","2026-05-24","2026-05-25","2026-05-26","2026-05-27","2026-05-28","2026-05-29","2026-05-30","2026-05-31"]
[{"$f":"A8","v":46143},{"$f":"B8","v":46144},{"$f":"C8","v":46145},{"$f":"D8","v":46146},{"$f":"E8","v":46147},{"$f":"F8","v":46148},{"$f":"G8","v":46149},{"$f":"H8","v":46150},{"$f":"I8","v":46151},{"$f":"J8","v":46152},{"$f":"K8","v":46153},{"$f":"L8","v":46154},{"$f":"M8","v":46155},{"$f":"N8","v":46156},{"$f":"O8","v":46157},{"$f":"P8","v":46158},{"$f":"Q8","v":46159},{"$f":"R8","v":46160},{"$f":"S8","v":46161},{"$f":"T8","v":46162},{"$f":"U8","v":46163},{"$f":"V8","v":46164},{"$f":"W8","v":46165},{"$f":"X8","v":46166},{"$f":"Y8","v":46167},{"$f":"Z8","v":46168},{"$f":"AA8","v":46169},{"$f":"AB8","v":46170},{"$f":"AC8","v":46171},{"$f":"AD8","v":46172},{"$f":"AE8","v":46173}]
[{"$f":"IFERROR(VLOOKUP(A8,祝祭日,6,0),IFERROR(VLOOKUP(A8,振替日,4,0)&\"の振替\",IFERROR(VLOOKUP(A8,入札スケジュール,15,0)&VLOOKUP(A8,入札スケジュール,16,0)&CHAR(10)&CHAR(10)&VLOOKUP(A8,入札スケジュール,17,0)&VLOOKUP(A8,入札スケジュール,18,0),\"\")))","v":"天皇即位の日"},"国民の休日","憲法記念日","みどりの日","こどもの日","こどもの日の振替","","","","","","","","","","","","","","","","","","","","","","","","",""]
[]
[{"$f":"EDATE(A2,2)","v":"2026-06-01"}]
[{"$f":"A12","v":"2026-06-01"},{"$f":"A13+1","v":"2026-06-02"},{"$f":"B13+1","v":"2026-06-03"},"2026-06-04","2026-06-05","2026-06-06","2026-06-07","2026-06-08","2026-06-09","2026-06-10","2026-06-11","2026-06-12","2026-06-13","2026-06-14","2026-06-15","2026-06-16","2026-06-17","2026-06-18","2026-06-19","2026-06-20","2026-06-21","2026-06-22","2026-06-23","2026-06-24","2026-06-25","2026-06-26","2026-06-27","2026-06-28","2026-06-29","2026-06-30","2026-07-01"]
[{"$f":"A13","v":46174},{"$f":"B13","v":46175},{"$f":"C13","v":46176},{"$f":"D13","v":46177},{"$f":"E13","v":46178},{"$f":"F13","v":46179},{"$f":"G13","v":46180},{"$f":"H13","v":46181},{"$f":"I13","v":46182},{"$f":"J13","v":46183},{"$f":"K13","v":46184},{"$f":"L13","v":46185},{"$f":"M13","v":46186},{"$f":"N13","v":46187},{"$f":"O13","v":46188},{"$f":"P13","v":46189},{"$f":"Q13","v":46190},{"$f":"R13","v":46191},{"$f":"S13","v":46192},{"$f":"T13","v":46193},{"$f":"U13","v":46194},{"$f":"V13","v":46195},{"$f":"W13","v":46196},{"$f":"X13","v":46197},{"$f":"Y13","v":46198},{"$f":"Z13","v":46199},{"$f":"AA13","v":46200},{"$f":"AB13","v":46201},{"$f":"AC13","v":46202},{"$f":"AD13","v":46203},{"$f":"AE13","v":46204}]
[{"$f":"IFERROR(VLOOKUP(A13,祝祭日,6,0),IFERROR(VLOOKUP(A13,振替日,4,0)&\"の振替\",IFERROR(VLOOKUP(A13,入札スケジュール,15,0)&VLOOKUP(A13,入札スケジュール,16,0)&CHAR(10)&CHAR(10)&VLOOKUP(A13,入札スケジュール,17,0)&VLOOKUP(A13,入札スケジュール,18,0),\"\")))","v":""},"","","","","","","","","","","","","","","","","","","","","","","","","","","","","",""]
[]
[null,null,null,null,null,null,null,null,null,null,null,null,null,null,null,null,null,null,null,null,null,null,null,{"$f":"IF(入力!D17>入力!M17,入力!L17,\"\")","v":""}]

{"sheet":"祝祭日","index":18,"n_rows":25,"n_cols":6,"rows_kept":25,"cut":false,"hidden":false,"merged":[]}
["年月日",null,"振替日","月","日","祝祭日"]
[{"$f":"DATE(YEAR(入力!$P$16),D2,E2)","v":"2026-04-29"},{"$f":"WEEKDAY(A2,1)","v":4},{"$f":"IF(WEEKDAY(A2,1)=1,A2+1,\"\")","v":""},4,29,"昭和の日"]
[{"$f":"DATE(YEAR(入力!$P$16),D3,E3)","v":"2026-05-03"},1,"2026-05-04",5,3,"憲法記念日"]
[{"$f":"DATE(YEAR(入力!$P$16),D4,E4)","v":"2026-05-04"},2,"",5,4,"みどりの日"]
[{"$f":"DATE(YEAR(入力!$P$16),D5,E5)","v":"2026-05-05"},3,{"$f":"IF(WEEKDAY(A5,1)<=3,A5+1,\"\")","v":"2026-05-06"},5,5,"こどもの日"]
[{"$f":"DATE(YEAR(入力!$P$16),7,21)-WEEKDAY(DATE(YEAR(入力!$P$16),7,21),3)","v":"2026-07-20"},2,"",7,"7月第3月曜日","海の日"]
[{"$f":"DATE(YEAR(入力!$P$16),D7,E7)","v":"2026-08-11"},3,"",8,11,"山の日"]
[{"$f":"DATE(YEAR(入力!$P$16),9,21)-WEEKDAY(DATE(YEAR(入力!$P$16),9,21),3)","v":"2026-09-21"},2,"",9,"9月第3月曜日","敬老の日"]
[{"$f":"DATE(YEAR(入力!$P$16),9,25)-MATCH(YEAR(入力!$P$16),CHOOSE(MOD(YEAR(入力!$P$16),4)+1,{0,1900,2012},{1901,1921,2045},{1902,1950,2078},{1903,1983}))","v":"2026-09-23"},4,"",9,"秋分(2099年まで)","秋分の日"]
[{"$f":"DATE(YEAR(入力!$P$16),10,14)-WEEKDAY(DATE(YEAR(入力!$P$16),10,14),3)","v":"2026-10-12"},2,"",10,"10月第2月曜日","体育の日"]
[{"$f":"DATE(YEAR(入力!$P$16),D11,E11)","v":"2026-11-03"},3,"",11,3,"文化の日"]
[{"$f":"DATE(YEAR(入力!$P$16),D12,E12)","v":"2026-11-23"},2,"",11,23,"勤労感謝の日"]
[{"$f":"DATE(YEAR(入力!$P$16)+1,D13,E13)","v":"2027-01-01"},6,{"$f":"IF(WEEKDAY(A13,1)=1,A13+1,\"\")","v":""},1,1,"元日"]
[{"$f":"DATE(YEAR($A$13),D14,14)-WEEKDAY(DATE(YEAR($A$13),D14,14),3)","v":"2027-01-11"},2,{"$f":"IF(WEEKDAY(A14,1)=1,A14+1,\"\")","v":""},1,"1月第2月曜日","成人の日"]
[{"$f":"DATE(YEAR($A$13),D15,E15)","v":"2027-02-11"},5,{"$f":"IF(WEEKDAY(A15,1)=1,A15+1,\"\")","v":""},2,11,"建国記念の日"]
[{"$f":"DATE(YEAR($A$13),D16,E16)","v":"2027-02-23"},3,{"$f":"IF(WEEKDAY(A16,1)=1,A16+1,\"\")","v":""},2,23,"天皇誕生日"]
[{"$f":"DATE(YEAR($A$13),3,23)-MATCH(YEAR($A$13),CHOOSE(MOD(YEAR($A$13),4)+1, {0,1900,1960,2092},{0,1901,1993},{0,1902,2026},{1903,1927,2059}))","v":"2027-03-21"},1,{"$f":"IF(WEEKDAY(A17,1)=1,A17+1,\"\")","v":"2027-03-22"},3,"春分(2099年まで)","春分の日"]
[{"$f":"DATE(YEAR(入力!$P$16),D18,E18)","v":"2026-12-29"},3,null,12,29,"休日"]
[{"$f":"DATE(YEAR(入力!$P$16),D19,E19)","v":"2026-12-30"},4,null,12,30,"休日"]
[{"$f":"DATE(YEAR(入力!$P$16),D20,E20)","v":"2026-12-31"},5,null,12,31,"休日"]
{"$rows_left_out":6}
{"sheet":"入力補助","index":19,"n_rows":14,"n_cols":19,"rows_kept":14,"cut":false,"hidden":false,"merged":[]}
[null,"局名","負担官",null,"入札参加資格","資格","期間","開始基準",null,"有効年度(物)","有効年度(建)","有効年度(測)",null,"労働保険料納付期限","全期・第1期","第2期","第3期",null,"担当者"]
[null,"北海道",null,null,"物品製造等","全省庁統一資格",3,43556,null,{"$f":"H2","v":43556},{"$f":"H3","v":43556},{"$f":"H4","v":43556},null,"通常",{"$f":"IF(MONTH(入力!D14)>=4,DATE(YEAR(入力!D14),7,12),DATE(YEAR(入力!D14)-1,7,12))","v":"2026-07-12"},{"$f":"IF(MONTH(入力!D14)>=4,DATE(YEAR(入力!D14),11,1),DATE(YEAR(入力!D14)-1,11,1))","v":"2026-11-01"},{"$f":"IF(MONTH(入力!D14)>=4,DATE(YEAR(入力!D14)+1,1,31),DATE(YEAR(入力!D14),1,31))","v":"2027-01-31"},null,"久松　正典"]
[null,"青森",null,null,"建設工事","厚労省競争参加資格",2,43556,null,{"$f":"EDATE(J2,$G$2*12)","v":44652},{"$f":"EDATE(K2,$G$3*12)","v":44287},{"$f":"EDATE(L2,$G$4*12)","v":44287},null,"口座振替",{"$f":"IF(MONTH(入力!D14)>=4,DATE(YEAR(入力!D14),9,6),DATE(YEAR(入力!D14)-1,9,6))","v":"2026-09-06"},{"$f":"IF(MONTH(入力!D14)>=4,DATE(YEAR(入力!D14),11,15),DATE(YEAR(入力!D14)-1,11,15))","v":"2026-11-15"},{"$f":"IF(MONTH(入力!D14)>=4,DATE(YEAR(入力!D14)+1,2,14),DATE(YEAR(入力!D14),2,14))","v":"2027-02-14"},null,"熊谷　光平"]
[null,"岩手",null,null,"測量・建設コンサルタント等業務","厚労省競争参加資格",2,43556,null,{"$f":"EDATE(J3,$G$2*12)","v":45748},{"$f":"EDATE(K3,$G$3*12)","v":45017},{"$f":"EDATE(L3,$G$4*12)","v":45017},null,"事務組合委託",{"$f":"IF(MONTH(入力!D14)>=4,DATE(YEAR(入力!D14),7,12),DATE(YEAR(入力!D14)-1,7,12))","v":"2026-07-12"},{"$f":"IF(MONTH(入力!D14)>=4,DATE(YEAR(入力!D14),11,15),DATE(YEAR(入力!D14)-1,11,15))","v":"2026-11-15"},{"$f":"IF(MONTH(入力!D14)>=4,DATE(YEAR(入力!D14)+1,2,14),DATE(YEAR(入力!D14),2,14))","v":"2027-02-14"}]
[null,"宮城",null,null,null,null,null,null,null,46844,45748,45748]
[null,"秋田","総務部長",null,null,null,null,null,null,47939,46478,46478]
[null,"山形",null,null,null,null,null,null,null,{"$f":"EDATE(J6,$G$2*12)","v":49035},{"$f":"EDATE(K6,$G$3*12)","v":47209},{"$f":"EDATE(L6,$G$4*12)","v":47209}]
[null,"福島",null,null,null,null,null,null,null,50131,47939,47939]
[null,null,null,null,null,null,null,null,null,51227,48670,48670]
[null,null,null,null,null,null,null,null,null,52322,49400,49400]
[null,null,null,null,null,null,null,null,null,53418,50131,50131]
[null,null,null,null,null,null,null,null,null,54514,50861,50861]
[null,null,null,null,null,null,null,null,null,55610,51592,51592]
[null,"東京","総務部長",null,null,null,null,null,null,56705,52322,52322]